Reaction Details
TargetFibroblast growth factor receptor 2
LigandBDBM50596831
Substrate/Competitorn/a
Meas. Tech.ChEMBL_2222384 (CHEMBL5135718)
IC50<0.500000±n/a nM
Citation Ryu, SNam, YKim, NShin, IJeon, EKim, YKim, NDSim, T Identification of Pyridinyltriazine Derivatives as Potent panFGFR Inhibitors against Gatekeeper Mutants for Overcoming Drug Resistance. J Med Chem65:6017-6038 (2022) 
 
Fibroblast growth factor receptor 2
Name:Fibroblast growth factor receptor 2
Type:Enzyme
Mol. Mass.:92015.45
Organism:Homo sapiens (Human)
Description:P21802
Residue:821
BDBM50596831
NameBDBM50596831
Synonyms:CHEMBL5177100
TypeSmall organic molecule
Emp. Form.C28H30Cl2N8O2
Mol. Mass.581.496
SMILESCOc1cc(OC)c(Cl)c(Nc2ncccc2-c2ncnc(Nc3ccc(cc3)N3C[C@H](C)N[C@H](C)C3)n2)c1Cl