Reaction Details
TargetHistone deacetylase 6
LigandBDBM19130
Substrate/Competitorn/a
Meas. Tech.ChEMBL_321270 (CHEMBL881895)
IC50 91±n/a nM
Citation Shinji, CNakamura, TMaeda, SYoshida, MHashimoto, YMiyachi, H Design and synthesis of phthalimide-type histone deacetylase inhibitors. Bioorg Med Chem Lett15:4427-31 (2005) 
 
Histone deacetylase 6
Name:Histone deacetylase 6
Type:Chromatin regulator; hydrolase; repressor
Mol. Mass.:131381.51
Organism:Homo sapiens (Human)
Description:Q9UBN7
Residue:1215
BDBM19130
NameBDBM19130
Synonyms:(2E,4E,6R)-7-[4-(dimethylamino)phenyl]-N-hydroxy-4,6-dimethyl-7-oxohepta-2,4-dienamide TSA | Trichostatin A (TSA)
TypeSmall organic molecule
Emp. Form.C17H22N2O3
Mol. Mass.302.3682
SMILESCC(C=CC(=O)NO)C=C(C)C(=O)c1ccc(cc1)N(C)C