Reaction Details
TargetSerine protease 1/Trypsin-2
LigandBDBM50172843
Substrate/Competitorn/a
Meas. Tech.ChEMBL_320753 (CHEMBL884567)
Ki 86±n/a nM
Citation Deng, JZMcMasters, DRRabbat, PMWilliams, PDCoburn, CAYan, YKuo, LCLewis, SDLucas, BJKrueger, JAStrulovici, BVacca, JPLyle, TABurgey, CS Development of an oxazolopyridine series of dual thrombin/factor Xa inhibitors via structure-guided lead optimization. Bioorg Med Chem Lett15:4411-6 (2005) 
 
Serine protease 1/Trypsin-2
Name:Serine protease 1/Trypsin-2
Synonyms:Trypsin II
Type:n/a
Mol. Mass.:n/a
Description:ASSAY_ID of EBI is 212335
Components:This complex has 2 components.
Component 1
Name:Serine protease 1
Type:Enzyme
Mol. Mass.:26557.80
Organism:Homo sapiens (Human)
Description:P07477
Residue:247
Component 2
Name:Trypsin-2
Synonyms:Anionic trypsinogen Serine protease 2 TRY2_HUMAN Thrombin & trypsin Trypsin II | Trypsin-2
Type:PROTEIN
Mol. Mass.:26479.43
Organism:Homo sapiens (Human)
Description:ChEMBL_41517
Residue:247
BDBM50172843
NameBDBM50172843
Synonyms:(2,2-Difluoro-2-piperidin-2-yl-ethyl)-[2-(2-[1,2,4]triazol-1-yl-benzyl)-oxazolo[4,5-c]pyridin-4-yl]-amine | CHEMBL197984
TypeSmall organic molecule
Emp. Form.C22H23F2N7O
Mol. Mass.439.4611
SMILESFC(F)(CNc1nccc2oc(Cc3ccccc3-n3cncn3)nc12)C1CCCCN1