Reaction Details
TargetCoagulation factor X
LigandBDBM50172835
Substrate/Competitorn/a
Meas. Tech.ChEMBL_320803 (CHEMBL884758)
Ki 11±n/a nM
Citation Deng, JZMcMasters, DRRabbat, PMWilliams, PDCoburn, CAYan, YKuo, LCLewis, SDLucas, BJKrueger, JAStrulovici, BVacca, JPLyle, TABurgey, CS Development of an oxazolopyridine series of dual thrombin/factor Xa inhibitors via structure-guided lead optimization. Bioorg Med Chem Lett15:4411-6 (2005) 
 
Coagulation factor X
Name:Coagulation factor X
Type:Enzyme
Mol. Mass.:54726.60
Organism:Homo sapiens (Human)
Description:n/a
Residue:488
BDBM50172835
NameBDBM50172835
Synonyms:(2,2-Difluoro-2-piperidin-2-yl-ethyl)-[2-(2-tetrazol-1-yl-benzyl)-oxazolo[4,5-c]pyridin-4-yl]-amine | CHEMBL198416
TypeSmall organic molecule
Emp. Form.C21H22F2N8O
Mol. Mass.440.4492
SMILESFC(F)(CNc1nccc2oc(Cc3ccccc3-n3cnnn3)nc12)C1CCCCN1