Reaction Details
TargetCoagulation factor X
LigandBDBM50172852
Substrate/Competitorn/a
Meas. Tech.ChEMBL_320803 (CHEMBL884758)
Ki 0.77±n/a nM
Citation Deng, JZMcMasters, DRRabbat, PMWilliams, PDCoburn, CAYan, YKuo, LCLewis, SDLucas, BJKrueger, JAStrulovici, BVacca, JPLyle, TABurgey, CS Development of an oxazolopyridine series of dual thrombin/factor Xa inhibitors via structure-guided lead optimization. Bioorg Med Chem Lett15:4411-6 (2005) 
 
Coagulation factor X
Name:Coagulation factor X
Type:Enzyme
Mol. Mass.:54726.60
Organism:Homo sapiens (Human)
Description:n/a
Residue:488
BDBM50172852
NameBDBM50172852
Synonyms:CHEMBL196315 | [2-(5-Chloro-2-[1,2,4]triazol-1-yl-benzyl)-oxazolo[4,5-c]pyridin-4-yl]-(2,2-difluoro-2-pyridin-2-yl-ethyl)-amine
TypeSmall organic molecule
Emp. Form.C22H16ClF2N7O
Mol. Mass.467.859
SMILESFC(F)(CNc1nccc2oc(Cc3cc(Cl)ccc3-n3cncn3)nc12)c1ccccn1