Reaction Details
TargetSigma non-opioid intracellular receptor 1
LigandBDBM50172891
Substrate/Competitorn/a
Meas. Tech.ChEMBL_321541 (CHEMBL881479)
pH7.5±n/a
IC50 82.3±n/a nM
Commentsextracted
Citation Cazenave Gassiot, ACharton, JGirault-Mizzi, SGilleron, PDebreu-Fontaine, MASergheraert, CMelnyk, P Synthesis and pharmacological evaluation of Tic-hydantoin derivatives as selective sigma1 ligands. Part 2. Bioorg Med Chem Lett15:4828-32 (2005) 
 
Sigma non-opioid intracellular receptor 1
Name:Sigma non-opioid intracellular receptor 1
Type:Enzyme Catalytic Domain
Mol. Mass.:25124.85
Organism:Homo sapiens (Human)
Description:Q99720
Residue:223
BDBM50172891
NameBDBM50172891
Synonyms:(S)-2-[3-(1-Benzyl-piperidin-4-ylamino)-propyl]-10,10a-dihydro-5H-imidazo[1,5-b]isoquinoline-1,3-dione | CHEMBL196100
TypeSmall organic molecule
Emp. Form.C26H32N4O2
Mol. Mass.432.5579
SMILESOc1c2Cc3ccccc3Cn2c(=O)n1CCCNC1CCN(Cc2ccccc2)CC1