Reaction Details
TargetAlpha-2C adrenergic receptor
LigandBDBM50173164
Substrate/Competitorn/a
Meas. Tech.ChEMBL_320873 (CHEMBL884798)
Ki 13±n/a nM
Citation Hong, SSBavadekar, SALee, SIPatil, PNLalchandani, SGFeller, DRMiller, DD Bioisosteric phentolamine analogs as potent alpha-adrenergic antagonists. Bioorg Med Chem Lett15:4691-5 (2005) 
 
Alpha-2C adrenergic receptor
Name:Alpha-2C adrenergic receptor
Type:Enzyme
Mol. Mass.:49552.32
Organism:Homo sapiens (Human)
Description:P18825
Residue:462
BDBM50173164
NameBDBM50173164
Synonyms:3-[N'-(4,5-Dihydro-1H-imidazol-2-yl)-N-p-tolyl-hydrazino]-phenol | CHEMBL194849
TypeSmall organic molecule
Emp. Form.C16H18N4O
Mol. Mass.282.3403
SMILES[#6]-c1ccc(cc1)-[#7](\[#7]=[#6]-1/[#7]-[#6]-[#6]-[#7]-1)-c1cccc(-[#8])c1