Reaction Details
TargetAdenosine receptor A1
LigandBDBM50173185
Substrate/Competitorn/a
Meas. Tech.ChEMBL_320961 (CHEMBL885368)
Ki>250±n/a nM
Citation Dowling, JEVessels, JTHaque, SChang, HXvan Vloten, KKumaravel, GEngber, TJin, XPhadke, DWang, JAyyub, EPetter, RC Synthesis of [1,2,4]triazolo[1,5-a]pyrazines as adenosine A2A receptor antagonists. Bioorg Med Chem Lett15:4809-13 (2005) 
 
Adenosine receptor A1
Name:Adenosine receptor A1
Type:Protein
Mol. Mass.:36704.13
Organism:Rattus norvegicus (rat)
Description:n/a
Residue:326
BDBM50173185
NameBDBM50173185
Synonyms:(8-Amino-2-furan-2-yl-[1,2,4]triazolo[1,5-a]pyrazin-6-yl)-morpholin-4-yl-methanone | CHEMBL196107
TypeSmall organic molecule
Emp. Form.C14H14N6O3
Mol. Mass.314.2994
SMILESNc1nc(cn2nc(nc12)-c1ccco1)C(=O)N1CCOCC1