Reaction Details
TargetAdenosine receptor A1
LigandBDBM50173181
Substrate/Competitorn/a
Meas. Tech.ChEMBL_320961 (CHEMBL885368)
Ki 290±n/a nM
Citation Dowling, JEVessels, JTHaque, SChang, HXvan Vloten, KKumaravel, GEngber, TJin, XPhadke, DWang, JAyyub, EPetter, RC Synthesis of [1,2,4]triazolo[1,5-a]pyrazines as adenosine A2A receptor antagonists. Bioorg Med Chem Lett15:4809-13 (2005) 
 
Adenosine receptor A1
Name:Adenosine receptor A1
Type:Protein
Mol. Mass.:36704.13
Organism:Rattus norvegicus (rat)
Description:n/a
Residue:326
BDBM50173181
NameBDBM50173181
Synonyms:3-(8-Amino-2-furan-2-yl-[1,2,4]triazolo[1,5-a]pyrazin-6-yl)-N-isopropyl-benzamide | CHEMBL372616
TypeSmall organic molecule
Emp. Form.C19H18N6O2
Mol. Mass.362.3852
SMILESCC(C)NC(=O)c1cccc(c1)-c1cn2nc(nc2c(N)n1)-c1ccco1