Reaction Details
TargetAdenosine receptor A2a
LigandBDBM50173210
Substrate/Competitorn/a
Meas. Tech.ChEMBL_320973 (CHEMBL885380)
Ki 110±n/a nM
Citation Dowling, JEVessels, JTHaque, SChang, HXvan Vloten, KKumaravel, GEngber, TJin, XPhadke, DWang, JAyyub, EPetter, RC Synthesis of [1,2,4]triazolo[1,5-a]pyrazines as adenosine A2A receptor antagonists. Bioorg Med Chem Lett15:4809-13 (2005) 
 
Adenosine receptor A2a
Name:Adenosine receptor A2a
Type:G Protein-Coupled Receptor (GPCR)
Mol. Mass.:45015.65
Organism:Rattus norvegicus (rat)
Description:Rat A2A receptors expressed in CHO cells.
Residue:410
BDBM50173210
NameBDBM50173210
Synonyms:2-Furan-2-yl-6-(3-methanesulfonyl-phenyl)-[1,2,4]triazolo[1,5-a]pyrazin-8-ylamine | CHEMBL372622
TypeSmall organic molecule
Emp. Form.C16H13N5O3S
Mol. Mass.355.371
SMILESCS(=O)(=O)c1cccc(c1)-c1cn2nc(nc2c(N)n1)-c1ccco1