Reaction Details
TargetEndochitinase B1
LigandBDBM50173286
Substrate/Competitorn/a
Meas. Tech.ChEMBL_320946 (CHEMBL882465)
Ki 17±n/a nM
Citation Dixon, MJAndersen, OAvan Aalten, DMEggleston, IM An efficient synthesis of argifin: a natural product chitinase inhibitor with chemotherapeutic potential. Bioorg Med Chem Lett15:4717-21 (2005) 
 
Endochitinase B1
Name:Endochitinase B1
Type:Enzyme
Mol. Mass.:47612.97
Organism:Aspergillus fumigatus
Description:Q873X9
Residue:433
BDBM50173286
NameBDBM50173286
Synonyms:5-[3-[amino-(methylcarbamoylamino)methylidene]aminopropyl]-8-benzyl-2,7-dimethyl-3,6,9,13,17-pentaoxo-1,4,7,10,14-pentazacycloheptadecane-11,15-dicarboxylic acid | CHEMBL197199
TypeSmall organic molecule
Emp. Form.C29H41N9O10
Mol. Mass.675.6901
SMILESCNC(=O)NC(N)=NCCC[C@@H]1NC(=O)[C@@H](C)NC(=O)C[C@H](NC(=O)C[C@H](NC(=O)[C@H](Cc2ccccc2)N(C)C1=O)C(O)=O)C(O)=O