Reaction Details
TargetC-C chemokine receptor type 5
LigandBDBM50157000
Substrate/Competitorn/a
Meas. Tech.ChEMBL_321534 (CHEMBL880594)
IC50 13±n/a nM
Citation Cumming, JGCooper, AEGrime, KLogan, CJMcLaughlin, SOldfield, JShaw, JSTucker, HWinter, JWhittaker, D Modulators of the human CCR5 receptor. Part 2: SAR of substituted 1-(3,3-diphenylpropyl)-piperidinyl phenylacetamides. Bioorg Med Chem Lett15:5012-5 (2005) 
 
C-C chemokine receptor type 5
Name:C-C chemokine receptor type 5
Type:Enzyme
Mol. Mass.:40540.21
Organism:Homo sapiens (Human)
Description:P51681
Residue:352
BDBM50157000
NameBDBM50157000
Synonyms:CHEMBL180155 N-allyl-N-(1-(3,3-diphenylpropyl)piperidin-4-yl)-2-(4-(methylsulfonyl)phenyl)acetamide
TypeSmall organic molecule
Emp. Form.C32H38N2O3S
Mol. Mass.530.721
SMILESCS(=O)(=O)c1ccc(CC(=O)N(CC=C)C2CCN(CCC(c3ccccc3)c3ccccc3)CC2)cc1