Reaction Details
TargetC-C chemokine receptor type 5
LigandBDBM50173376
Substrate/Competitorn/a
Meas. Tech.ChEMBL_321534 (CHEMBL880594)
IC50 18±n/a nM
Citation Cumming, JGCooper, AEGrime, KLogan, CJMcLaughlin, SOldfield, JShaw, JSTucker, HWinter, JWhittaker, D Modulators of the human CCR5 receptor. Part 2: SAR of substituted 1-(3,3-diphenylpropyl)-piperidinyl phenylacetamides. Bioorg Med Chem Lett15:5012-5 (2005) 
 
C-C chemokine receptor type 5
Name:C-C chemokine receptor type 5
Type:Enzyme
Mol. Mass.:40540.21
Organism:Homo sapiens (Human)
Description:P51681
Residue:352
BDBM50173376
NameBDBM50173376
Synonyms:CHEMBL198114 | N-Ethyl-N-{1-[3-(4-methanesulfonylamino-phenyl)-3-phenyl-propyl]-piperidin-4-yl}-2-(4-methanesulfonyl-phenyl)-acetamide
TypeSmall organic molecule
Emp. Form.C32H41N3O5S2
Mol. Mass.611.815
SMILESCCN(C1CCN(CCC(c2ccccc2)c2ccc(NS(C)(=O)=O)cc2)CC1)C(=O)Cc1ccc(cc1)S(C)(=O)=O