Reaction Details
TargetC-C chemokine receptor type 5
LigandBDBM50173382
Substrate/Competitorn/a
Meas. Tech.ChEMBL_321534 (CHEMBL880594)
IC50 9.1±n/a nM
Citation Cumming, JGCooper, AEGrime, KLogan, CJMcLaughlin, SOldfield, JShaw, JSTucker, HWinter, JWhittaker, D Modulators of the human CCR5 receptor. Part 2: SAR of substituted 1-(3,3-diphenylpropyl)-piperidinyl phenylacetamides. Bioorg Med Chem Lett15:5012-5 (2005) 
 
C-C chemokine receptor type 5
Name:C-C chemokine receptor type 5
Type:Enzyme
Mol. Mass.:40540.21
Organism:Homo sapiens (Human)
Description:P51681
Residue:352
BDBM50173382
NameBDBM50173382
Synonyms:CHEMBL373214 | N-Ethyl-N-{1-[3-(3-fluoro-phenyl)-3-(4-methanesulfonylamino-phenyl)-propyl]-piperidin-4-yl}-2-(4-methanesulfonyl-phenyl)-acetamide
TypeSmall organic molecule
Emp. Form.C32H40FN3O5S2
Mol. Mass.629.806
SMILESCCN(C1CCN(CCC(c2ccc(NS(C)(=O)=O)cc2)c2cccc(F)c2)CC1)C(=O)Cc1ccc(cc1)S(C)(=O)=O