Reaction Details
TargetC-C chemokine receptor type 5
LigandBDBM50173383
Substrate/Competitorn/a
Meas. Tech.ChEMBL_321534 (CHEMBL880594)
IC50 5.9±n/a nM
Citation Cumming, JGCooper, AEGrime, KLogan, CJMcLaughlin, SOldfield, JShaw, JSTucker, HWinter, JWhittaker, D Modulators of the human CCR5 receptor. Part 2: SAR of substituted 1-(3,3-diphenylpropyl)-piperidinyl phenylacetamides. Bioorg Med Chem Lett15:5012-5 (2005) 
 
C-C chemokine receptor type 5
Name:C-C chemokine receptor type 5
Type:Enzyme
Mol. Mass.:40540.21
Organism:Homo sapiens (Human)
Description:P51681
Residue:352
BDBM50173383
NameBDBM50173383
Synonyms:CHEMBL199118 | N-Ethyl-2-(4-methanesulfonyl-phenyl)-N-{1-[3-phenyl-3-(4-phenylacetylamino-phenyl)-propyl]-piperidin-4-yl}-acetamide
TypeSmall organic molecule
Emp. Form.C39H45N3O4S
Mol. Mass.651.857
SMILESCCN(C1CCN(CCC(c2ccccc2)c2ccc(NC(=O)Cc3ccccc3)cc2)CC1)C(=O)Cc1ccc(cc1)S(C)(=O)=O