Reaction Details
TargetEstrogen receptor beta
LigandBDBM50173654
Substrate/Competitorn/a
Meas. Tech.ChEMBL_320908 (CHEMBL881235)
Ki 0.49±n/a nM
Citation Clegg, NJParuthiyil, SLeitman, DCScanlan, TS Differential response of estrogen receptor subtypes to 1,3-diarylindene and 2,3-diarylindene ligands. J Med Chem48:5989-6003 (2005) 
 
Estrogen receptor beta
Name:Estrogen receptor beta
Type:Protein
Mol. Mass.:59238.43
Organism:Homo sapiens (Human)
Description:Q92731
Residue:530
BDBM50173654
NameBDBM50173654
Synonyms:1-(4-Chloro-phenyl)-2-(4-hydroxy-phenyl)-3H-inden-5-ol | CHEMBL364442
TypeSmall organic molecule
Emp. Form.C21H15ClO2
Mol. Mass.334.796
SMILESOc1ccc(cc1)C1=C(c2ccc(O)cc2C1)c1ccc(Cl)cc1