Reaction Details
TargetEstrogen receptor
LigandBDBM50173668
Substrate/Competitorn/a
Meas. Tech.ChEMBL_321124 (CHEMBL884979)
EC50 17±n/a nM
Citation Clegg, NJParuthiyil, SLeitman, DCScanlan, TS Differential response of estrogen receptor subtypes to 1,3-diarylindene and 2,3-diarylindene ligands. J Med Chem48:5989-6003 (2005) 
 
Estrogen receptor
Name:Estrogen receptor
Type:Protein
Mol. Mass.:66230.44
Organism:Homo sapiens (Human)
Description:P03372
Residue:595
BDBM50173668
NameBDBM50173668
Synonyms:2-(4-Hydroxy-phenyl)-1-p-tolyl-3H-inden-5-ol | CHEMBL197188
TypeSmall organic molecule
Emp. Form.C22H18O2
Mol. Mass.314.3771
SMILESCc1ccc(cc1)C1=C(Cc2cc(O)ccc12)c1ccc(O)cc1