Reaction Details
TargetGABA-A receptor; alpha-5/beta-3/gamma-2
LigandBDBM50173674
Substrate/Competitorn/a
Meas. Tech.ChEMBL_321027 (CHEMBL883659)
pH7.4±n/a
Ki 3.4±n/a nM
Commentsextracted
Citation van Niel, MBWilson, KAdkins, CHAtack, JRCastro, JLClarke, DEFletcher, SGerhard, UMackey, MMMalpas, SMaubach, KNewman, RO'Connor, DPillai, GVSimpson, PBThomas, SRMacLeod, AM A new pyridazine series of GABAA alpha5 ligands. J Med Chem48:6004-11 (2005) 
 
GABA-A receptor; alpha-5/beta-3/gamma-2
Name:GABA-A receptor; alpha-5/beta-3/gamma-2
Type:n/a
Mol. Mass.:n/a
Description:ASSAY_ID of ChEMBL is 2148177
Components:This complex has 3 components.
Component 1
Name:Gamma-aminobutyric acid receptor subunit gamma-2
Synonyms:GABA(A) receptor subunit gamma-2 GBRG2_HUMAN
Type:PROTEIN
Mol. Mass.:54172.74
Organism:Homo sapiens (Human)
Description:EBI_217
Residue:467
Component 2
Name:Gamma-aminobutyric acid receptor subunit beta-3
Synonyms:GABA A receptor alpha-4/beta-3/gamma-2 GABA-A receptor GBRB3_HUMAN | agonist GABA site
Type:PROTEIN
Mol. Mass.:54130.51
Organism:Homo sapiens (Human)
Description:ChEMBL_448071
Residue:473
Component 3
Name:Gamma-aminobutyric acid receptor subunit alpha-5
Synonyms:GABA receptor alpha-5 subunit GABRA5 Gamma-aminobutyric acid receptor subunit alpha-5 (GABA(A)) | Gamma-aminobutyric acid receptor subunit alpha-5 (GABAA)
Type:Enzyme
Mol. Mass.:52160.59
Organism:Homo sapiens (Human)
Description:P31644
Residue:462
BDBM50173674
NameBDBM50173674
Synonyms:3-[6-(2-Fluoro-phenyl)-pyridazin-4-yl]-benzonitrile | CHEMBL196250
TypeSmall organic molecule
Emp. Form.C17H10FN3
Mol. Mass.275.2798
SMILESFc1ccccc1-c1cc(cnn1)-c1cccc(c1)C#N