Reaction Details
TargetMitogen-activated protein kinase kinase kinase 8
LigandBDBM50173835
Substrate/Competitorn/a
Meas. Tech.ChEMBL_326807 (CHEMBL860389)
IC50>40000±n/a nM
Citation Gavrin, LKGreen, NHu, YJanz, KKaila, NLi, HQTam, SYThomason, JRGopalsamy, ACiszewski, GCuozzo, JWHall, JPHsu, STelliez, JBLin, LL Inhibition of Tpl2 kinase and TNF-alpha production with 1,7-naphthyridine-3-carbonitriles: synthesis and structure-activity relationships. Bioorg Med Chem Lett15:5288-92 (2005) 
 
Mitogen-activated protein kinase kinase kinase 8
Name:Mitogen-activated protein kinase kinase kinase 8
Type:Serine/threonine-protein kinase
Mol. Mass.:52916.89
Organism:Homo sapiens (Human)
Description:P41279
Residue:467
BDBM50173835
NameBDBM50173835
Synonyms:4-(3-bromo-2-methylphenylamino)-6-(2-morpholinoethylamino)-1,7-naphthyridine-3-carbonitrile | CHEMBL198904
TypeSmall organic molecule
Emp. Form.C22H23BrN6O
Mol. Mass.467.362
SMILESCc1c(Br)cccc1Nc1c(cnc2cnc(NCCN3CCOCC3)cc12)C#N