Reaction Details
TargetMitogen-activated protein kinase kinase kinase 8
LigandBDBM50173839
Substrate/Competitorn/a
Meas. Tech.ChEMBL_326807 (CHEMBL860389)
IC50>40000±n/a nM
Citation Gavrin, LKGreen, NHu, YJanz, KKaila, NLi, HQTam, SYThomason, JRGopalsamy, ACiszewski, GCuozzo, JWHall, JPHsu, STelliez, JBLin, LL Inhibition of Tpl2 kinase and TNF-alpha production with 1,7-naphthyridine-3-carbonitriles: synthesis and structure-activity relationships. Bioorg Med Chem Lett15:5288-92 (2005) 
 
Mitogen-activated protein kinase kinase kinase 8
Name:Mitogen-activated protein kinase kinase kinase 8
Type:Serine/threonine-protein kinase
Mol. Mass.:52916.89
Organism:Homo sapiens (Human)
Description:P41279
Residue:467
BDBM50173839
NameBDBM50173839
Synonyms:6-(benzyl(methyl)amino)-4-(3-chloro-4-fluorophenylamino)-1,7-naphthyridine-3-carbonitrile | CHEMBL198647
TypeSmall organic molecule
Emp. Form.C23H17ClFN5
Mol. Mass.417.866
SMILESCN(Cc1ccccc1)c1cc2c(Nc3ccc(F)c(Cl)c3)c(cnc2cn1)C#N