Reaction Details
TargetMitogen-activated protein kinase kinase kinase 8
LigandBDBM50173842
Substrate/Competitorn/a
Meas. Tech.ChEMBL_326807 (CHEMBL860389)
IC50>40000±n/a nM
Citation Gavrin, LKGreen, NHu, YJanz, KKaila, NLi, HQTam, SYThomason, JRGopalsamy, ACiszewski, GCuozzo, JWHall, JPHsu, STelliez, JBLin, LL Inhibition of Tpl2 kinase and TNF-alpha production with 1,7-naphthyridine-3-carbonitriles: synthesis and structure-activity relationships. Bioorg Med Chem Lett15:5288-92 (2005) 
 
Mitogen-activated protein kinase kinase kinase 8
Name:Mitogen-activated protein kinase kinase kinase 8
Type:Serine/threonine-protein kinase
Mol. Mass.:52916.89
Organism:Homo sapiens (Human)
Description:P41279
Residue:467
BDBM50173842
NameBDBM50173842
Synonyms:6-(2-morpholinoethylamino)-4-(4-(trifluoromethyl)phenylamino)-1,7-naphthyridine-3-carbonitrile | CHEMBL198577
TypeSmall organic molecule
Emp. Form.C22H21F3N6O
Mol. Mass.442.4369
SMILESFC(F)(F)c1ccc(Nc2c(cnc3cnc(NCCN4CCOCC4)cc23)C#N)cc1