Reaction Details
TargetProto-oncogene tyrosine-protein kinase Src
LigandBDBM50173833
Substrate/Competitorn/a
Meas. Tech.ChEMBL_326810 (CHEMBL860331)
IC50 3000±n/a nM
Citation Gavrin, LKGreen, NHu, YJanz, KKaila, NLi, HQTam, SYThomason, JRGopalsamy, ACiszewski, GCuozzo, JWHall, JPHsu, STelliez, JBLin, LL Inhibition of Tpl2 kinase and TNF-alpha production with 1,7-naphthyridine-3-carbonitriles: synthesis and structure-activity relationships. Bioorg Med Chem Lett15:5288-92 (2005) 
 
Proto-oncogene tyrosine-protein kinase Src
Name:Proto-oncogene tyrosine-protein kinase Src
Type:Protein
Mol. Mass.:59838.60
Organism:Homo sapiens (Human)
Description:P12931
Residue:536
BDBM50173833
NameBDBM50173833
Synonyms:6-(2-morpholinoethylamino)-4-(4-(phenylthio)phenylamino)-1,7-naphthyridine-3-carbonitrile | CHEMBL199210
TypeSmall organic molecule
Emp. Form.C27H26N6OS
Mol. Mass.482.6
SMILESN#Cc1cnc2cnc(NCCN3CCOCC3)cc2c1Nc1ccc(Sc2ccccc2)cc1