Reaction Details
TargetMitogen-activated protein kinase kinase kinase 8
LigandBDBM50173833
Substrate/Competitorn/a
Meas. Tech.ChEMBL_326807 (CHEMBL860389)
IC50 6±n/a nM
Citation Gavrin, LKGreen, NHu, YJanz, KKaila, NLi, HQTam, SYThomason, JRGopalsamy, ACiszewski, GCuozzo, JWHall, JPHsu, STelliez, JBLin, LL Inhibition of Tpl2 kinase and TNF-alpha production with 1,7-naphthyridine-3-carbonitriles: synthesis and structure-activity relationships. Bioorg Med Chem Lett15:5288-92 (2005) 
 
Mitogen-activated protein kinase kinase kinase 8
Name:Mitogen-activated protein kinase kinase kinase 8
Type:Serine/threonine-protein kinase
Mol. Mass.:52916.89
Organism:Homo sapiens (Human)
Description:P41279
Residue:467
BDBM50173833
NameBDBM50173833
Synonyms:6-(2-morpholinoethylamino)-4-(4-(phenylthio)phenylamino)-1,7-naphthyridine-3-carbonitrile | CHEMBL199210
TypeSmall organic molecule
Emp. Form.C27H26N6OS
Mol. Mass.482.6
SMILESN#Cc1cnc2cnc(NCCN3CCOCC3)cc2c1Nc1ccc(Sc2ccccc2)cc1