Reaction Details
TargetCarbonic anhydrase 12
LigandBDBM16645
Substrate/Competitorn/a
Meas. Tech.ChEMBL_320720 (CHEMBL881706)
Ki 56±n/a nM
Citation Ozensoy, OPuccetti, LFasolis, GArslan, OScozzafava, ASupuran, CT Carbonic anhydrase inhibitors: inhibition of the tumor-associated isozymes IX and XII with a library of aromatic and heteroaromatic sulfonamides. Bioorg Med Chem Lett15:4862-6 (2005) 
 
Carbonic anhydrase 12
Name:Carbonic anhydrase 12
Type:Enzyme
Mol. Mass.:39456.00
Organism:Homo sapiens (Human)
Description:Catalytic domain of human cloned isozyme was used in the assay
Residue:354
BDBM16645
NameBDBM16645
Synonyms:4-Propionamido-benzenesulfonamide N-(4-sulfamoylphenyl)propanamide | aromatic sulfonamide compound 10
TypeSmall organic molecule
Emp. Form.C9H12N2O3S
Mol. Mass.228.268
SMILESCCC(=O)Nc1ccc(cc1)S(N)(=O)=O