Reaction Details
TargetCarbonic anhydrase 2
LigandBDBM50174034
Substrate/Competitorn/a
Meas. Tech.ChEMBL_320718 (CHEMBL881704)
Ki 2±n/a nM
Citation Ozensoy, OPuccetti, LFasolis, GArslan, OScozzafava, ASupuran, CT Carbonic anhydrase inhibitors: inhibition of the tumor-associated isozymes IX and XII with a library of aromatic and heteroaromatic sulfonamides. Bioorg Med Chem Lett15:4862-6 (2005) 
 
Carbonic anhydrase 2
Name:Carbonic anhydrase 2
Type:Enzyme
Mol. Mass.:29250.71
Organism:Homo sapiens (Human)
Description:P00918
Residue:260
BDBM50174034
NameBDBM50174034
Synonyms:5-(4-Bromo-cyclohexa-2,4-dienesulfonylamino)-[1,3,4]thiadiazole-2-sulfonic acid amide | CHEMBL194634
TypeSmall organic molecule
Emp. Form.C8H7BrN4O4S3
Mol. Mass.399.265
SMILESNS(=O)(=O)c1nnc(NS(=O)(=O)c2ccc(Br)cc2)s1