Reaction Details
TargetCarbonic anhydrase 1
LigandBDBM50174033
Substrate/Competitorn/a
Meas. Tech.ChEMBL_320717 (CHEMBL881703)
Ki 245±n/a nM
Citation Ozensoy, OPuccetti, LFasolis, GArslan, OScozzafava, ASupuran, CT Carbonic anhydrase inhibitors: inhibition of the tumor-associated isozymes IX and XII with a library of aromatic and heteroaromatic sulfonamides. Bioorg Med Chem Lett15:4862-6 (2005) 
 
Carbonic anhydrase 1
Name:Carbonic anhydrase 1
Type:Enzyme
Mol. Mass.:28873.37
Organism:Homo sapiens (Human)
Description:P00915
Residue:261
BDBM50174033
NameBDBM50174033
Synonyms:CHEMBL193825 | N-[4-(4-Sulfamoyl-phenylamino)-cyclohexa-2,4-dienyl]-acetamide
TypeSmall organic molecule
Emp. Form.C14H15N3O3S
Mol. Mass.305.352
SMILESCC(=O)Nc1ccc(Nc2ccc(cc2)S(N)(=O)=O)cc1