Reaction Details
TargetCarbonic anhydrase 2
LigandBDBM16649
Substrate/Competitorn/a
Meas. Tech.ChEMBL_320718 (CHEMBL881704)
Ki 230±n/a nM
Citation Ozensoy, OPuccetti, LFasolis, GArslan, OScozzafava, ASupuran, CT Carbonic anhydrase inhibitors: inhibition of the tumor-associated isozymes IX and XII with a library of aromatic and heteroaromatic sulfonamides. Bioorg Med Chem Lett15:4862-6 (2005) 
 
Carbonic anhydrase 2
Name:Carbonic anhydrase 2
Type:Enzyme
Mol. Mass.:29250.71
Organism:Homo sapiens (Human)
Description:P00918
Residue:260
BDBM16649
NameBDBM16649
Synonyms:2,2-dimethyl-N-(4-sulfamoylphenyl)propanamide CHEMBL23285 | aromatic sulfonamide compound 14
TypeSmall organic molecule
Emp. Form.C11H16N2O3S
Mol. Mass.256.321
SMILESCC(C)(C)C(=O)Nc1ccc(cc1)S(N)(=O)=O