Reaction Details
TargetCarbonic anhydrase 2
LigandBDBM16646
Substrate/Competitorn/a
Meas. Tech.ChEMBL_320718 (CHEMBL881704)
Ki 227±n/a nM
Citation Ozensoy, OPuccetti, LFasolis, GArslan, OScozzafava, ASupuran, CT Carbonic anhydrase inhibitors: inhibition of the tumor-associated isozymes IX and XII with a library of aromatic and heteroaromatic sulfonamides. Bioorg Med Chem Lett15:4862-6 (2005) 
 
Carbonic anhydrase 2
Name:Carbonic anhydrase 2
Type:Enzyme
Mol. Mass.:29250.71
Organism:Homo sapiens (Human)
Description:P00918
Residue:260
BDBM16646
NameBDBM16646
Synonyms:4-n-Butanamido-benzenesulfonamide N-(4-sulfamoylphenyl)butanamide | aromatic sulfonamide compound 11
TypeSmall organic molecule
Emp. Form.C10H14N2O3S
Mol. Mass.242.295
SMILESCCCC(=O)Nc1ccc(cc1)S(N)(=O)=O