Reaction Details
TargetCarbonic anhydrase 2
LigandBDBM16643
Substrate/Competitorn/a
Meas. Tech.ChEMBL_320718 (CHEMBL881704)
Ki 246±n/a nM
Citation Ozensoy, OPuccetti, LFasolis, GArslan, OScozzafava, ASupuran, CT Carbonic anhydrase inhibitors: inhibition of the tumor-associated isozymes IX and XII with a library of aromatic and heteroaromatic sulfonamides. Bioorg Med Chem Lett15:4862-6 (2005) 
 
Carbonic anhydrase 2
Name:Carbonic anhydrase 2
Type:Enzyme
Mol. Mass.:29250.71
Organism:Homo sapiens (Human)
Description:P00918
Residue:260
BDBM16643
NameBDBM16643
Synonyms:4-Acetamido-benzenesulfonamide N-(4-sulfamoylphenyl)acetamide | aromatic sulfonamide compound 8
TypeSmall organic molecule
Emp. Form.C8H10N2O3S
Mol. Mass.214.242
SMILESCC(=O)Nc1ccc(cc1)S(N)(=O)=O