Reaction Details
TargetCarbonic anhydrase 1
LigandBDBM16656
Substrate/Competitorn/a
Meas. Tech.ChEMBL_320717 (CHEMBL881703)
Ki 430±n/a nM
Citation Ozensoy, OPuccetti, LFasolis, GArslan, OScozzafava, ASupuran, CT Carbonic anhydrase inhibitors: inhibition of the tumor-associated isozymes IX and XII with a library of aromatic and heteroaromatic sulfonamides. Bioorg Med Chem Lett15:4862-6 (2005) 
 
Carbonic anhydrase 1
Name:Carbonic anhydrase 1
Type:Enzyme
Mol. Mass.:28873.37
Organism:Homo sapiens (Human)
Description:P00915
Residue:261
BDBM16656
NameBDBM16656
Synonyms:1-phenyl-3-[2-(4-sulfamoylphenyl)ethyl]urea aromatic sulfonamide compound 21
TypeSmall organic molecule
Emp. Form.C15H17N3O3S
Mol. Mass.319.379
SMILESNS(=O)(=O)c1ccc(CCNC(=O)Nc2ccccc2)cc1