Reaction Details
TargetCarbonic anhydrase 9
LigandBDBM16652
Substrate/Competitorn/a
Meas. Tech.ChEMBL_320719 (CHEMBL881705)
Ki 73±n/a nM
Citation Ozensoy, OPuccetti, LFasolis, GArslan, OScozzafava, ASupuran, CT Carbonic anhydrase inhibitors: inhibition of the tumor-associated isozymes IX and XII with a library of aromatic and heteroaromatic sulfonamides. Bioorg Med Chem Lett15:4862-6 (2005) 
 
Carbonic anhydrase 9
Name:Carbonic anhydrase 9
Type:Enzyme
Mol. Mass.:49669.03
Organism:Homo sapiens (Human)
Description:Catalytic domain of human cloned isozyme was used in the assay
Residue:459
BDBM16652
NameBDBM16652
Synonyms:4-Benzoylamino-benzenesulfonamide N-(4-sulfamoylphenyl)benzamide | aromatic sulfonamide compound 17
TypeSmall organic molecule
Emp. Form.C13H12N2O3S
Mol. Mass.276.311
SMILESNS(=O)(=O)c1ccc(NC(=O)c2ccccc2)cc1