Reaction Details
TargetCarbonic anhydrase 12
LigandBDBM11635
Substrate/Competitorn/a
Meas. Tech.ChEMBL_320720 (CHEMBL881706)
Ki 13±n/a nM
Citation Ozensoy, OPuccetti, LFasolis, GArslan, OScozzafava, ASupuran, CT Carbonic anhydrase inhibitors: inhibition of the tumor-associated isozymes IX and XII with a library of aromatic and heteroaromatic sulfonamides. Bioorg Med Chem Lett15:4862-6 (2005) 
 
Carbonic anhydrase 12
Name:Carbonic anhydrase 12
Type:Enzyme
Mol. Mass.:39456.00
Organism:Homo sapiens (Human)
Description:Catalytic domain of human cloned isozyme was used in the assay
Residue:354
BDBM11635
NameBDBM11635
Synonyms:4-sulfamoyl-N-[2-(4-sulfamoylphenyl)ethyl]benzamide Sulfonamide 2
TypeSmall organic molecule
Emp. Form.C15H17N3O5S2
Mol. Mass.383.443
SMILESNS(=O)(=O)c1ccc(CCNC(=O)c2ccc(cc2)S(N)(=O)=O)cc1