Reaction Details
TargetPhenylethanolamine N-methyltransferase
LigandBDBM13014
Substrate/Competitorn/a
Meas. Tech.ChEMBL_326878 (CHEMBL862979)
Ki 3.1±n/a nM
Citation Grunewald, GLLu, JCriscione, KROkoro, CO Inhibitors of phenylethanolamine N-methyltransferase devoid of alpha2-adrenoceptor affinity. Bioorg Med Chem Lett15:5319-23 (2005) 
 
Phenylethanolamine N-methyltransferase
Name:Phenylethanolamine N-methyltransferase
Type:Enzyme
Mol. Mass.:30852.66
Organism:Homo sapiens (Human)
Description:n/a
Residue:282
BDBM13014
NameBDBM13014
Synonyms:7,8-Dichloro-1,2,3,4-tetrahydro-isoquinoline; hydrochloride CHEMBL287837 SKF 64139 | tetrahydroisoquinoline (THIQ) analogue
TypeSmall organic molecule
Emp. Form.C9H9Cl2N
Mol. Mass.202.08
SMILESClc1ccc2CCNCc2c1Cl