Reaction Details
TargetPhenylethanolamine N-methyltransferase
LigandBDBM50174121
Substrate/Competitorn/a
Meas. Tech.ChEMBL_326878 (CHEMBL862979)
Ki 17±n/a nM
Citation Grunewald, GLLu, JCriscione, KROkoro, CO Inhibitors of phenylethanolamine N-methyltransferase devoid of alpha2-adrenoceptor affinity. Bioorg Med Chem Lett15:5319-23 (2005) 
 
Phenylethanolamine N-methyltransferase
Name:Phenylethanolamine N-methyltransferase
Type:Enzyme
Mol. Mass.:30852.66
Organism:Homo sapiens (Human)
Description:n/a
Residue:282
BDBM50174121
NameBDBM50174121
Synonyms:7-bromo-3-methyl-1,2,3,4-tetrahydroisoquinoline CHEMBL200375
TypeSmall organic molecule
Emp. Form.C10H12BrN
Mol. Mass.226.113
SMILESCC1Cc2ccc(Br)cc2CN1