Reaction Details
TargetPhenylethanolamine N-methyltransferase
LigandBDBM14060
Substrate/Competitorn/a
Meas. Tech.ChEMBL_326878 (CHEMBL862979)
Ki 93±n/a nM
Citation Grunewald, GLLu, JCriscione, KROkoro, CO Inhibitors of phenylethanolamine N-methyltransferase devoid of alpha2-adrenoceptor affinity. Bioorg Med Chem Lett15:5319-23 (2005) 
 
Phenylethanolamine N-methyltransferase
Name:Phenylethanolamine N-methyltransferase
Type:Enzyme
Mol. Mass.:30852.66
Organism:Homo sapiens (Human)
Description:n/a
Residue:282
BDBM14060
NameBDBM14060
Synonyms:7-Iodo-1,2,3,4-tetrahydroisoquinoline tetrahydroisoquinoline (THIQ) deriv. 2
TypeSmall organic molecule
Emp. Form.C9H10IN
Mol. Mass.259.0869
SMILESIc1ccc2CCNCc2c1