Reaction Details
TargetIntegrase
LigandBDBM50174222
Substrate/Competitorn/a
Meas. Tech.ChEMBL_321235 (CHEMBL881770)
IC50 1000±n/a nM
Citation Bailly, FQueffelec, CMbemba, GMouscadet, JFCotelle, P Synthesis and HIV-1 integrase inhibitory activities of caffeic acid dimers derived from Salvia officinalis. Bioorg Med Chem Lett15:5053-6 (2005) 
 
Integrase
Name:Integrase
Synonyms:Human immunodeficiency virus type 1 integrase
Type:PROTEIN
Mol. Mass.:32231.48
Organism:Human immunodeficiency virus 1
Description:ChEMBL_90865
Residue:288
BDBM50174222
NameBDBM50174222
TypeSmall organic molecule
Emp. Form.C18H12O8
Mol. Mass.356.2831
SMILESOC(=O)\C=C\c1ccc(O)c(Oc2cc3cc(O)c(O)cc3oc2=O)c1