Reaction Details
Target5-hydroxytryptamine receptor 6
LigandBDBM34151
Substrate/Competitorn/a
Meas. Tech.ChEMBL_326768 (CHEMBL860114)
Ki 10±n/a nM
Citation Pullagurla, MSiripurapu, UKolanos, RBondarev, MLDukat, MSetola, VRoth, BLGlennon, RA Binding of amine-substituted N1-benzenesulfonylindoles at human 5-HT6 serotonin receptors. Bioorg Med Chem Lett15:5298-302 (2005) 
 
5-hydroxytryptamine receptor 6
Name:5-hydroxytryptamine receptor 6
Type:G Protein-Coupled Receptor (GPCR)
Mol. Mass.:46968.43
Organism:Homo sapiens (Human)
Description:P50406
Residue:440
BDBM34151
NameBDBM34151
Synonyms:CHEMBL372109 | N-arenesulfonylindole antagonist, 10
TypeSmall organic molecule
Emp. Form.C14H12N2O2S
Mol. Mass.272.322
SMILESNc1ccc(cc1)S(=O)(=O)n1ccc2ccccc12