Reaction Details
Target5-hydroxytryptamine receptor 6
LigandBDBM50174267
Substrate/Competitorn/a
Meas. Tech.ChEMBL_326768 (CHEMBL860114)
Ki 26±n/a nM
Citation Pullagurla, MSiripurapu, UKolanos, RBondarev, MLDukat, MSetola, VRoth, BLGlennon, RA Binding of amine-substituted N1-benzenesulfonylindoles at human 5-HT6 serotonin receptors. Bioorg Med Chem Lett15:5298-302 (2005) 
 
5-hydroxytryptamine receptor 6
Name:5-hydroxytryptamine receptor 6
Type:G Protein-Coupled Receptor (GPCR)
Mol. Mass.:46968.43
Organism:Homo sapiens (Human)
Description:P50406
Residue:440
BDBM50174267
NameBDBM50174267
Synonyms:CHEMBL198797 | N4,N6-dimethyl-1-(phenylsulfonyl)-1H-indole-4,6-diamine
TypeSmall organic molecule
Emp. Form.C16H17N3O2S
Mol. Mass.315.39
SMILESCNc1cc(NC)c2ccn(c2c1)S(=O)(=O)c1ccccc1