Reaction Details
Target5-hydroxytryptamine receptor 6
LigandBDBM50174271
Substrate/Competitorn/a
Meas. Tech.ChEMBL_326768 (CHEMBL860114)
Ki 2700±n/a nM
Citation Pullagurla, MSiripurapu, UKolanos, RBondarev, MLDukat, MSetola, VRoth, BLGlennon, RA Binding of amine-substituted N1-benzenesulfonylindoles at human 5-HT6 serotonin receptors. Bioorg Med Chem Lett15:5298-302 (2005) 
 
5-hydroxytryptamine receptor 6
Name:5-hydroxytryptamine receptor 6
Type:G Protein-Coupled Receptor (GPCR)
Mol. Mass.:46968.43
Organism:Homo sapiens (Human)
Description:P50406
Residue:440
BDBM50174271
NameBDBM50174271
Synonyms:4-(piperazin-1-yl)-1H-indole | CHEMBL200234
TypeSmall organic molecule
Emp. Form.C12H15N3
Mol. Mass.201.2676
SMILESC1CN(CCN1)c1cccc2[nH]ccc12