Reaction Details
Target5-hydroxytryptamine receptor 6
LigandBDBM50174272
Substrate/Competitorn/a
Meas. Tech.ChEMBL_326768 (CHEMBL860114)
Ki 21±n/a nM
Citation Pullagurla, MSiripurapu, UKolanos, RBondarev, MLDukat, MSetola, VRoth, BLGlennon, RA Binding of amine-substituted N1-benzenesulfonylindoles at human 5-HT6 serotonin receptors. Bioorg Med Chem Lett15:5298-302 (2005) 
 
5-hydroxytryptamine receptor 6
Name:5-hydroxytryptamine receptor 6
Type:G Protein-Coupled Receptor (GPCR)
Mol. Mass.:46968.43
Organism:Homo sapiens (Human)
Description:P50406
Residue:440
BDBM50174272
NameBDBM50174272
Synonyms:1-(4-aminophenylsulfonyl)-N-methyl-1H-indol-4-amine | CHEMBL381415
TypeSmall organic molecule
Emp. Form.C15H15N3O2S
Mol. Mass.301.364
SMILESCNc1cccc2n(ccc12)S(=O)(=O)c1ccc(N)cc1