Reaction Details
TargetRetinoic acid receptor RXR-alpha
LigandBDBM50101445
Substrate/Competitorn/a
Meas. Tech.ChEMBL_320731 (CHEMBL880876)
Kd 0.4±n/a nM
Citation Sussman, Fde Lera, AR Ligand recognition by RAR and RXR receptors: binding and selectivity. J Med Chem48:6212-9 (2005) 
 
Retinoic acid receptor RXR-alpha
Name:Retinoic acid receptor RXR-alpha
Type:PROTEIN
Mol. Mass.:50820.38
Organism:Homo sapiens (Human)
Description:ChEMBL_1456363
Residue:462
BDBM50101445
NameBDBM50101445
Synonyms:(2E,4E)-3-Methyl-5-[(1S,2S)-2-methyl-2-(5,5,8,8-tetramethyl-5,6,7,8-tetrahydro-naphthalen-2-yl)-cyclopropyl]-penta-2,4-dienoic acid CHEMBL75133
TypeSmall organic molecule
Emp. Form.C24H32O2
Mol. Mass.352.5097
SMILESC\C(\C=C\[C@@H]1C[C@]1(C)c1ccc2c(c1)C(C)(C)CCC2(C)C)=C/C(O)=O