Reaction Details
TargetAurora kinase A
LigandBDBM50174696
Substrate/Competitorn/a
Meas. Tech.ChEMBL_326666 (CHEMBL868729)
IC50>10000±n/a nM
Citation Pan, WLiu, HXu, YJChen, XKim, KHMilligan, DLColumbus, JHadari, YRKussie, PWong, WCLabelle, M Pyrimido-oxazepine as a versatile template for the development of inhibitors of specific kinases. Bioorg Med Chem Lett15:5474-7 (2005) 
 
Aurora kinase A
Name:Aurora kinase A
Type:Serine/threonine-protein kinase
Mol. Mass.:45830.98
Organism:Homo sapiens (Human)
Description:O14965
Residue:403
BDBM50174696
NameBDBM50174696
Synonyms:CHEMBL371458 | N-[5-(6-methoxy-10,11-dihydro-5-oxa-2,4,11-triaza-dibenzo[a,d]cyclohepten-1-ylamino)-pyrimidin-2-yl]-benzamide
TypeSmall organic molecule
Emp. Form.C23H19N7O3
Mol. Mass.441.4421
SMILESCOc1cccc2CNc3c(Nc4cnc(NC(=O)c5ccccc5)nc4)ncnc3Oc12