Reaction Details
TargetEstrogen receptor beta
LigandBDBM50157156
Substrate/Competitorn/a
Meas. Tech.ChEMBL_325825 (CHEMBL863237)
IC50 45±n/a nM
Citation Blizzard, TAMorgan, JDChan, WBirzin, ETPai, LYHayes, ECDaSilva, CAMosley, RTYang, YTRohrer, SPDininno, FHammond, ML Estrogen receptor ligands. Part 14: application of novel antagonist side chains to existing platforms. Bioorg Med Chem Lett15:5124-8 (2005) 
 
Estrogen receptor beta
Name:Estrogen receptor beta
Type:Protein
Mol. Mass.:59238.43
Organism:Homo sapiens (Human)
Description:Q92731
Residue:530
BDBM50157156
NameBDBM50157156
Synonyms:(2S,3R)-3-(4-HYDROXYPHENYL)-2-(4-{[(2S)-2-PYRROLIDIN-1-YLPROPYL]OXY}PHENYL)-2,3-DIHYDRO-1,4-BENZOXATHIIN-6-OL (2S,3R)-3-(4-hydroxyphenyl)-2-(4-((S)-2-(pyrrolidin-1-yl)propoxy)phenyl)-2,3-dihydrobenzo[b][1,4]oxathiin-6-ol | CHEMBL180300
TypeSmall organic molecule
Emp. Form.C27H29NO4S
Mol. Mass.463.588
SMILESC[C@@H](COc1ccc(cc1)[C@@H]1Oc2ccc(O)cc2S[C@@H]1c1ccc(O)cc1)N1CCCC1