Reaction Details
TargetEstrogen receptor
LigandBDBM50099585
Substrate/Competitorn/a
Meas. Tech.ChEMBL_325824 (CHEMBL863236)
IC50 0.6±n/a nM
Citation Blizzard, TAMorgan, JDChan, WBirzin, ETPai, LYHayes, ECDaSilva, CAMosley, RTYang, YTRohrer, SPDininno, FHammond, ML Estrogen receptor ligands. Part 14: application of novel antagonist side chains to existing platforms. Bioorg Med Chem Lett15:5124-8 (2005) 
 
Estrogen receptor
Name:Estrogen receptor
Type:Protein
Mol. Mass.:66230.44
Organism:Homo sapiens (Human)
Description:P03372
Residue:595
BDBM50099585
NameBDBM50099585
Synonyms:1-(4-(2-(azepan-1-yl)ethoxy)benzyl)-2-(4-hydroxyphenyl)-3-methyl-1H-indol-5-ol BAZEDOXIFENE US8815934, No. 98
TypeSmall organic molecule
Emp. Form.C30H34N2O3
Mol. Mass.470.6026
SMILESCc1c(-c2ccc(O)cc2)n(Cc2ccc(OCCN3CCCCCC3)cc2)c2ccc(O)cc12