Reaction Details
TargetEstrogen receptor beta
LigandBDBM50174925
Substrate/Competitorn/a
Meas. Tech.ChEMBL_325825 (CHEMBL863237)
IC50 3.1±n/a nM
Citation Blizzard, TAMorgan, JDChan, WBirzin, ETPai, LYHayes, ECDaSilva, CAMosley, RTYang, YTRohrer, SPDininno, FHammond, ML Estrogen receptor ligands. Part 14: application of novel antagonist side chains to existing platforms. Bioorg Med Chem Lett15:5124-8 (2005) 
 
Estrogen receptor beta
Name:Estrogen receptor beta
Type:Protein
Mol. Mass.:59238.43
Organism:Homo sapiens (Human)
Description:Q92731
Residue:530
BDBM50174925
NameBDBM50174925
Synonyms:(R)-(6-hydroxy-2-(4-hydroxyphenyl)benzo[b]thiophen-3-yl)(4-(2-(3-methylpyrrolidin-1-yl)ethoxy)phenyl)methanone | CHEMBL372337
TypeSmall organic molecule
Emp. Form.C28H27NO4S
Mol. Mass.473.583
SMILESC[C@@H]1CCN(CCOc2ccc(cc2)C(=O)c2c(sc3cc(O)ccc23)-c2ccc(O)cc2)C1