Reaction Details
TargetEstrogen receptor
LigandBDBM50169748
Substrate/Competitorn/a
Meas. Tech.ChEMBL_325824 (CHEMBL863236)
IC50 1.3±n/a nM
Citation Blizzard, TAMorgan, JDChan, WBirzin, ETPai, LYHayes, ECDaSilva, CAMosley, RTYang, YTRohrer, SPDininno, FHammond, ML Estrogen receptor ligands. Part 14: application of novel antagonist side chains to existing platforms. Bioorg Med Chem Lett15:5124-8 (2005) 
 
Estrogen receptor
Name:Estrogen receptor
Type:Protein
Mol. Mass.:66230.44
Organism:Homo sapiens (Human)
Description:P03372
Residue:595
BDBM50169748
NameBDBM50169748
Synonyms:(2S,3R)-3-(4-Hydroxy-phenyl)-2-{4-[(S)-2-((R)-3-methyl-pyrrolidin-1-yl)-propoxy]-phenyl}-2,3-dihydro-benzo[1,4]oxathiin-6-ol CHEMBL182402
TypeSmall organic molecule
Emp. Form.C28H31NO4S
Mol. Mass.477.615
SMILESC[C@@H](COc1ccc(cc1)[C@@H]1Oc2ccc(O)cc2S[C@@H]1c1ccc(O)cc1)N1CC[C@@H](C)C1