Reaction Details
TargetEstrogen receptor
LigandBDBM50149505
Substrate/Competitorn/a
Meas. Tech.ChEMBL_325824 (CHEMBL863236)
IC50 2.6±n/a nM
Citation Blizzard, TAMorgan, JDChan, WBirzin, ETPai, LYHayes, ECDaSilva, CAMosley, RTYang, YTRohrer, SPDininno, FHammond, ML Estrogen receptor ligands. Part 14: application of novel antagonist side chains to existing platforms. Bioorg Med Chem Lett15:5124-8 (2005) 
 
Estrogen receptor
Name:Estrogen receptor
Type:Protein
Mol. Mass.:66230.44
Organism:Homo sapiens (Human)
Description:P03372
Residue:595
BDBM50149505
NameBDBM50149505
Synonyms:(2S,3R)-3-(4-Hydroxy-phenyl)-2-[4-(2-pyrrolidin-1-yl-ethoxy)-phenyl]-2,3-dihydro-benzo[1,4]oxathiin-6-ol CHEMBL362623
TypeSmall organic molecule
Emp. Form.C26H27NO4S
Mol. Mass.449.562
SMILESOc1ccc(cc1)[C@H]1Sc2cc(O)ccc2O[C@H]1c1ccc(OCCN2CCCC2)cc1