Reaction Details
TargetEstrogen receptor beta
LigandBDBM50157145
Substrate/Competitorn/a
Meas. Tech.ChEMBL_325825 (CHEMBL863237)
IC50 161±n/a nM
Citation Blizzard, TAMorgan, JDChan, WBirzin, ETPai, LYHayes, ECDaSilva, CAMosley, RTYang, YTRohrer, SPDininno, FHammond, ML Estrogen receptor ligands. Part 14: application of novel antagonist side chains to existing platforms. Bioorg Med Chem Lett15:5124-8 (2005) 
 
Estrogen receptor beta
Name:Estrogen receptor beta
Type:Protein
Mol. Mass.:59238.43
Organism:Homo sapiens (Human)
Description:Q92731
Residue:530
BDBM50157145
NameBDBM50157145
Synonyms:(2S,3R)-3-(4-Hydroxy-phenyl)-2-{4-[2-((R)-3-methyl-pyrrolidin-1-yl)-ethoxy]-phenyl}-2,3-dihydro-benzo[1,4]oxathiin-6-ol CHEMBL183584
TypeSmall organic molecule
Emp. Form.C27H29NO4S
Mol. Mass.463.588
SMILESC[C@@H]1CCN(CCOc2ccc(cc2)[C@@H]2Oc3ccc(O)cc3S[C@@H]2c2ccc(O)cc2)C1