Reaction Details
TargetEstrogen receptor beta
LigandBDBM50174927
Substrate/Competitorn/a
Meas. Tech.ChEMBL_325825 (CHEMBL863237)
IC50 2.4±n/a nM
Citation Blizzard, TAMorgan, JDChan, WBirzin, ETPai, LYHayes, ECDaSilva, CAMosley, RTYang, YTRohrer, SPDininno, FHammond, ML Estrogen receptor ligands. Part 14: application of novel antagonist side chains to existing platforms. Bioorg Med Chem Lett15:5124-8 (2005) 
 
Estrogen receptor beta
Name:Estrogen receptor beta
Type:Protein
Mol. Mass.:59238.43
Organism:Homo sapiens (Human)
Description:Q92731
Residue:530
BDBM50174927
NameBDBM50174927
Synonyms:(R)-1-(4-(2-(3-methylpyrrolidin-1-yl)ethoxy)benzyl)-2-(4-hydroxyphenyl)-3-methyl-1H-indol-5-ol | CHEMBL198914
TypeSmall organic molecule
Emp. Form.C29H32N2O3
Mol. Mass.456.576
SMILESC[C@@H]1CCN(CCOc2ccc(Cn3c(c(C)c4cc(O)ccc34)-c3ccc(O)cc3)cc2)C1