Reaction Details
TargetDelta-type opioid receptor
LigandBDBM50174953
Substrate/Competitorn/a
Meas. Tech.ChEMBL_325674 (CHEMBL863228)
Ki>5000±n/a nM
Citation Chu, GHGu, MCassel, JABelanger, SGraczyk, TMDeHaven, RNConway-James, NKoblish, MLittle, PJDeHaven-Hudkins, DLDolle, RE Potent and highly selective kappa opioid receptor agonists incorporating chroman- and 2,3-dihydrobenzofuran-based constraints. Bioorg Med Chem Lett15:5114-9 (2005) 
 
Delta-type opioid receptor
Name:Delta-type opioid receptor
Type:G Protein-Coupled Receptor (GPCR)
Mol. Mass.:40382.98
Organism:Homo sapiens (Human)
Description:Competition binding assays were carried out using membrane preparations from transfected HN9.10 cells that constitutively expressed the delta opioid receptor.
Residue:372
BDBM50174953
NameBDBM50174953
Synonyms:5-acetamido-N-((S)-2-((S)-3-hydroxypyrrolidin-1-yl)-1-phenylethyl)-N-methyl-2,3-dihydrobenzofuran-2-carboxamide | CHEMBL382497
TypeSmall organic molecule
Emp. Form.C24H29N3O4
Mol. Mass.423.5048
SMILESCN([C@H](CN1CC[C@H](O)C1)c1ccccc1)C(=O)C1Cc2cc(NC(C)=O)ccc2O1